Target
Glycogen synthase kinase-3 alpha
Ligand
BDBM50434353
Substrate
Meas. Tech.
ChEMBL_2064267 (CHEMBL4719520)
IC50
7.4±n/a nM
Citation
 Chaikuad, ADiharce, JSchröder, MFoucourt, ALeblond, BCasagrande, ASDésiré, LBonnet, PKnapp, SBesson, T An Unusual Binding Model of the Methyl 9-Anilinothiazolo[5,4-f] quinazoline-2-carbimidates (EHT 1610 and EHT 5372) Confers High Selectivity for Dual-Specificity Tyrosine Phosphorylation-Regulated Kinases. J Med Chem 59:10315-10321 (2016)  
Target
Name:
Glycogen synthase kinase-3 alpha
Synonyms:
GSK-3 alpha GSK3A_HUMAN Glycogen synthase kinase-3 Glycogen synthase kinase-3 alpha (GSK3 Alpha) Glycogen synthase kinase-3 alpha (GSK3alpha)
Type:
Enzyme
Mol. Mass.:
50991.79
Organism:
Homo sapiens (Human)
Description:
P49840
Residue:
483
  
Inhibitor
Name:
BDBM50434353
Synonyms:
CHEMBL2386747 | US9446044, 72
Type:
Small organic molecule
Emp. Form.:
C17H11Cl2N5OS
Mol. Mass.:
404.273
SMILES:
COC(=N)c1nc2ccc3ncnc(Nc4ccc(Cl)cc4Cl)c3c2s1
: