Target
Cannabinoid receptor 1
Ligand
BDBM50063885
Substrate
Meas. Tech.
ChEBML_46634
Ki
0.320000±n/a nM
Citation
 Papahatjis, DPNikas, SPAndreou, TMakriyannis, A Novel 1',1'-chain substituted Delta(8)-tetrahydrocannabinols. Bioorg Med Chem Lett 12:3583-6 (2002)  
Target
Name:
Cannabinoid receptor 1
Synonyms:
Brain-type cannabinoid receptor CB-R CNR1_RAT Cannabinoid receptor Cnr1 | Skr6
Type:
G Protein-Coupled Receptor (GPCR)
Mol. Mass.:
52856.55
Organism:
Rattus norvegicus (rat)
Description:
P20272
Residue:
473
  
Inhibitor
Name:
BDBM50063885
Synonyms:
(-)-2-(6a,7,10,10a-tetrahydro-6,6,9-trimethyl-1-hydroxy-6H-dibenzo[ (6aR,10aR)-3-(2-Hexyl-[1,3]dithiolan-2-yl)-6,6,9-trimethyl-6a,7,10,10a-tetrahydro-6H-benzo[c]chromen-1-ol 3-(2-Hexyl-[1,3]dithiolan-2-yl)-6,6,9-trimethyl-6a,7,10,10a-tetrahydro-6H-benzo[c]chromen-1-ol | CHEMBL476325
Type:
Small organic molecule
Emp. Form.:
C25H36O2S2
Mol. Mass.:
432.682
SMILES:
CCCCCCC1(SCCS1)c1cc(O)c2[C@@H]3CC(C)=CC[C@H]3C(C)(C)Oc2c1
: