Target
S-adenosylmethionine synthase isoform type-2
Ligand
BDBM50559541
Substrate
Meas. Tech.
ChEMBL_2069762 (CHEMBL4725015)
IC50
<100±n/a nM
Citation
 Kargbo, RB Methionine Adenosyltransferase Inhibitors for the Treatment of Cancer. ACS Med Chem Lett 12:180-181 (2021)  
Target
Name:
S-adenosylmethionine synthase isoform type-2
Synonyms:
AMS2 MAT 2 MAT2A METK2_HUMAN Methionine adenosyltransferase II
Type:
Protein
Mol. Mass.:
43659.65
Organism:
Human
Description:
P31153
Residue:
395
  
Inhibitor
Name:
BDBM50559541
Synonyms:
CHEMBL4746939
Type:
Small organic molecule
Emp. Form.:
C24H16F5N5O3
Mol. Mass.:
517.4076
SMILES:
Cn1cc2cc(ccc2n1)-n1nc2ccc(OCC(F)(F)F)nc2c(-c2ccc(OC(F)F)cc2)c1=O
: