Target
S-adenosylmethionine synthase isoform type-2
Ligand
BDBM50559548
Substrate
Meas. Tech.
ChEMBL_2069763 (CHEMBL4725016)
IC50
<100±n/a nM
Citation
 Kargbo, RB Methionine Adenosyltransferase Inhibitors for the Treatment of Cancer. ACS Med Chem Lett 12:180-181 (2021)  
Target
Name:
S-adenosylmethionine synthase isoform type-2
Synonyms:
AMS2 MAT 2 MAT2A METK2_HUMAN Methionine adenosyltransferase II
Type:
Protein
Mol. Mass.:
43659.65
Organism:
Human
Description:
P31153
Residue:
395
  
Inhibitor
Name:
BDBM50559548
Synonyms:
CHEMBL4741054
Type:
Small organic molecule
Emp. Form.:
C25H19F4N5O4
Mol. Mass.:
532.4616
SMILES:
[2H]C([2H])([2H])Oc1n(C)nc2ccc(cc12)-n1nc2ccc(OCC(F)F)nc2c(-c2ccc(OC(F)F)cc2)c1=O
: