Target
Gamma-aminobutyric acid receptor subunit alpha-1/beta-2/gamma-2
Ligand
BDBM26266
Substrate
Meas. Tech.
ChEMBL_69937 (CHEMBL679467)
Ki
26.7±n/a nM
Citation
 Costanzo, AGuerrini, GCiciani, GBruni, FCostagli, CSelleri, SBesnard, FCosta, BMartini, CMalmberg-Aiello, P Benzodiazepine receptor ligands. 7. Synthesis and pharmacological evaluation of new 3-esters of the 8-chloropyrazolo[5,1-c][1,2,4]benzotriazine 5-oxide. 3-(2-Thienylmethoxycarbonyl) derivative: an anxioselective agent in rodents. J Med Chem 45:5710-20 (2002)  
Target
Name:
Gamma-aminobutyric acid receptor subunit alpha-1/beta-2/gamma-2
Synonyms:
GABA receptor alpha-1/beta-2/gamma-2 subunit GABAA Subunit α1β2γ2 | GABAA Subunit alpha-1, beta-2, gamma-2
Type:
Mol. Mass.:
Description:
ASSAY_ID of EBI is 69455
Components:
This complex has 3 components.
Component 1
Name:
Gamma-aminobutyric acid receptor subunit beta-2
Synonyms:
GBRB2_RAT Gabrb2 | Gamma-aminobutyric acid receptor subunit beta-2 (GABA(A) beta-2)
Type:
Enzyme
Mol. Mass.:
54648.97
Organism:
Rattus norvegicus (Rat)
Description:
P63138
Residue:
474
  
Component 2
Name:
Gamma-aminobutyric acid receptor subunit gamma-2
Synonyms:
GBRG2_RAT Gamma-aminobutyric acid receptor subunit gamma-2 (GABA(A) gamma-2)
Type:
Enzyme
Mol. Mass.:
54087.63
Organism:
Rattus norvegicus (Rat)
Description:
P18508
Residue:
466
  
Component 3
Name:
Gamma-aminobutyric acid receptor subunit alpha-1
Synonyms:
Benzodiazepine central GABA A Benzodiazepine GABA A Benzodiazepine Type II GABA A Benzodiazepine Type IIM GABA A Benzodiazepine omega2 GABA A alpha1 GABA receptor alpha-1 subunit GABA-PICROTOXIN Gabra-1 TBPS
Type:
Enzyme
Mol. Mass.:
51770.21
Organism:
Rattus norvegicus (Rat)
Description:
P62813
Residue:
455
  
Inhibitor
Name:
BDBM26266
Synonyms:
Ambien Dalparan ZPM Zolpidem tartrate
Type:
Small organic molecule
Emp. Form.:
C19H21N3O
Mol. Mass.:
307.3895
SMILES:
CN(C)C(=O)Cc1c(nc2ccc(C)cn12)-c1ccc(C)cc1
: