Target
5-hydroxytryptamine receptor 4
Ligand
BDBM50122718
Substrate
Meas. Tech.
ChEMBL_3274 (CHEMBL619075)
Ki
13±n/a nM
Citation
 Hinschberger, AButt, SLelong, VBoulouard, MDumuis, ADauphin, FBureau, RPfeiffer, BRenard, PRault, S New benzo[h][1,6]naphthyridine and azepino[3,2-c]quinoline derivatives as selective antagonists of 5-HT4 receptors: binding profile and pharmacological characterization. J Med Chem 46:138-47 (2002)  
Target
Name:
5-hydroxytryptamine receptor 4
Synonyms:
5-HT4 5HT4R_CAVPO Serotonin 4 (5-HT4) receptor
Type:
Enzyme Catalytic Domain
Mol. Mass.:
43735.29
Organism:
GUINEA PIG
Description:
5-HT4 HTR4 GUINEA PIG::O70528
Residue:
388
  
Inhibitor
Name:
BDBM50122718
Synonyms:
6-(1-Propyl-piperidin-4-ylmethoxy)-8,9,10,11-tetrahydro-7H-5,11-diaza-cyclohepta[a]naphthalene | CHEMBL35196
Type:
Small organic molecule
Emp. Form.:
C22H31N3O
Mol. Mass.:
353.501
SMILES:
CCCN1CCC(COc2nc3ccccc3c3NCCCCc23)CC1
: