Target
Carbonic anhydrase 13
Ligand
BDBM10880
Substrate
Meas. Tech.
ChEMBL_2073667 (CHEMBL4729201)
Ki
16±n/a nM
Citation
 Kaur, JCao, XAbutaleb, NSElkashif, AGraboski, ALKrabill, ADAbdelKhalek, AHAn, WBhardwaj, ASeleem, MNFlaherty, DP Optimization of Acetazolamide-Based Scaffold as Potent Inhibitors of Vancomycin-Resistant  J Med Chem 63:9540-9562 (2020)  
Target
Name:
Carbonic anhydrase 13
Synonyms:
CA13 Carbonic anhydrase Carbonic anhydrase XIII (CA XIII)
Type:
Enzyme
Mol. Mass.:
29445.78
Organism:
Homo sapiens (Human)
Description:
Q8N1Q1
Residue:
262
  
Inhibitor
Name:
BDBM10880
Synonyms:
AZA AZM acetazolamide Acetazolamide Acetazolamide (AZA) Acetazolamide, 5 Acetazolamide, AZA CHEMBL20 Sulfonamide, 1 US11278534, Example acetazolamide sulfonamide 1
Type:
Small organic molecule
Emp. Form.:
C4H6N4O3S2
Mol. Mass.:
222.245
SMILES:
CC(=O)Nc1nnc(s1)S(N)(=O)=O
: