Target
Arginase-1
Ligand
BDBM50561046
Substrate
Meas. Tech.
ChEMBL_2074196 (CHEMBL4729730)
Ki
<10.0±n/a nM
Citation
 Borek, BGajda, TGolebiowski, ABlaszczyk, R Boronic acid-based arginase inhibitors in cancer immunotherapy. Bioorg Med Chem 28:0 (2020)  
Target
Name:
Arginase-1
Synonyms:
ARG1 Liver-type arginase | Type I arginase
Type:
PROTEIN
Mol. Mass.:
34737.53
Organism:
Homo sapiens (Human)
Description:
ChEMBL_978893
Residue:
322
  
Inhibitor
Name:
BDBM50561046
Synonyms:
CHEMBL4790798
Type:
Small organic molecule
Emp. Form.:
C17H29BN2O4
Mol. Mass.:
336.234
SMILES:
NC(CCCCB(O)O)(CCCNCCc1ccccc1)C(O)=O
: