Target
Neuropeptide Y receptor type 5
Ligand
BDBM50123737
Substrate
Meas. Tech.
ChEMBL_144127 (CHEMBL750100)
Ki
1.2±n/a nM
Citation
 Elliott, RLOliver, RMHammond, MPatterson, TAShe, LHargrove, DMMartin, KAMaurer, TSKalvass, JCMorgan, BPDaSilva-Jardine, PAStevenson, RWMack, CMCassella, JV In vitro and in vivo characterization of 3-[2-[6-(2-tert-butoxyethoxy)pyridin-3-yl]-1H-imidazol-4-yl]benzonitrile hydrochloride salt, a potent and selective NPY5 receptor antagonist. J Med Chem 46:670-3 (2003)  
Target
Name:
Neuropeptide Y receptor type 5
Synonyms:
NPY-Y5 NPY5-R NPY5R_HUMAN NPYY5 Neuropeptide Y receptor type 5 ( NPY Y5) | Y5 receptor
Type:
Enzyme
Mol. Mass.:
50746.64
Organism:
Homo sapiens (Human)
Description:
Q15761
Residue:
445
  
Inhibitor
Name:
BDBM50123737
Synonyms:
3-{2-[6-(2-tert-Butoxy-ethoxy)-pyridin-3-yl]-3H-imidazol-4-yl}-benzonitrile | CHEMBL161724
Type:
Small organic molecule
Emp. Form.:
C21H22N4O2
Mol. Mass.:
362.425
SMILES:
CC(C)(C)OCCOc1ccc(cn1)-c1nc(c[nH]1)-c1cccc(c1)C#N
: