Target
Estrogen receptor beta
Ligand
BDBM17289
Substrate
Meas. Tech.
ChEMBL_2074717 (CHEMBL4730251)
EC50
>10.0±n/a nM
Citation
 Wetzel, EAHanson, AMTroutfetter, CLBurkett, DJSem, DSDonaldson, WA Synthesis and evaluation of 17?-triazolyl and 9?-cyano derivatives of estradiol. Bioorg Med Chem 28:0 (2020)  
Target
Name:
Estrogen receptor beta
Synonyms:
ER-beta ESR2_HUMAN Estradiol receptor beta (ERβ) Estrogen receptor (ER beta) Estrogen receptor beta (ER beta) NR3A2 estrogen beta
Type:
Protein
Mol. Mass.:
59238.43
Organism:
Homo sapiens (Human)
Description:
Q92731
Residue:
530
  
Inhibitor
Name:
BDBM17289
Synonyms:
(1S,10R,11S,15S)-5-hydroxy-15-methyltetracyclo[8.7.0.0^{2,7}.0^{11,15}]heptadeca-2,4,6-trien-14-one Estrone Estrone, 15 Kestrone Unigen [2,4,6,7-3H]-Estrone | folliculin
Type:
Steroid
Emp. Form.:
C18H22O2
Mol. Mass.:
270.3661
SMILES:
[H][C@@]12CCC(=O)[C@@]1(C)CC[C@]1([H])c3ccc(O)cc3CC[C@@]21[H]
: