Target
Kappa-type opioid receptor
Ligand
BDBM50123996
Substrate
Meas. Tech.
ChEMBL_146518 (CHEMBL882417)
Ki
2.5±n/a nM
Citation
 Wentland, MPYe, YCioffi, CLLou, RZhou, QXu, GDuan, WDehnhardt, CMSun, XCohen, DJBidlack, JM Syntheses and opioid receptor binding affinities of 8-amino-2,6-methano-3-benzazocines. J Med Chem 46:838-49 (2003)  
Target
Name:
Kappa-type opioid receptor
Synonyms:
Kappa Opioid Receptor OPRK1 Opiate Kappa 1 | mu/kappa opioid receptor
Type:
G Protein-Coupled Receptor (GPCR)
Mol. Mass.:
42744.99
Organism:
Cavia porcellus (domestic guinea pig)
Description:
P41144
Residue:
380
  
Inhibitor
Name:
BDBM50123996
Synonyms:
(4-Chloro-phenyl)-(3-cyclopropylmethyl-6,11-dimethyl-1,2,3,4,5,6-hexahydro-2,6-methano-benzo[d]azocin-8-yl)-amine | CHEMBL169030
Type:
Small organic molecule
Emp. Form.:
C24H29ClN2
Mol. Mass.:
380.953
SMILES:
C[C@H]1C2Cc3ccc(Nc4ccc(Cl)cc4)cc3[C@@]1(C)CCN2CC1CC1
: