Target
Kappa-type opioid receptor
Ligand
BDBM50123988
Substrate
Meas. Tech.
ChEMBL_146518 (CHEMBL882417)
Ki
0.570000±n/a nM
Citation
 Wentland, MPYe, YCioffi, CLLou, RZhou, QXu, GDuan, WDehnhardt, CMSun, XCohen, DJBidlack, JM Syntheses and opioid receptor binding affinities of 8-amino-2,6-methano-3-benzazocines. J Med Chem 46:838-49 (2003)  
Target
Name:
Kappa-type opioid receptor
Synonyms:
Kappa Opioid Receptor OPRK1 Opiate Kappa 1 | mu/kappa opioid receptor
Type:
G Protein-Coupled Receptor (GPCR)
Mol. Mass.:
42744.99
Organism:
Cavia porcellus (domestic guinea pig)
Description:
P41144
Residue:
380
  
Inhibitor
Name:
BDBM50123988
Synonyms:
(3-Cyclopropylmethyl-6,11-dimethyl-1,2,3,4,5,6-hexahydro-2,6-methano-benzo[d]azocin-8-yl)-p-tolyl-amine | CHEMBL355403
Type:
Small organic molecule
Emp. Form.:
C25H32N2
Mol. Mass.:
360.535
SMILES:
C[C@H]1C2Cc3ccc(Nc4ccc(C)cc4)cc3[C@@]1(C)CCN2CC1CC1
: