Target
Kappa-type opioid receptor
Ligand
BDBM50123992
Substrate
Meas. Tech.
ChEMBL_146518 (CHEMBL882417)
Ki
2.2±n/a nM
Citation
 Wentland, MPYe, YCioffi, CLLou, RZhou, QXu, GDuan, WDehnhardt, CMSun, XCohen, DJBidlack, JM Syntheses and opioid receptor binding affinities of 8-amino-2,6-methano-3-benzazocines. J Med Chem 46:838-49 (2003)  
Target
Name:
Kappa-type opioid receptor
Synonyms:
Kappa Opioid Receptor OPRK1 Opiate Kappa 1 | mu/kappa opioid receptor
Type:
G Protein-Coupled Receptor (GPCR)
Mol. Mass.:
42744.99
Organism:
Cavia porcellus (domestic guinea pig)
Description:
P41144
Residue:
380
  
Inhibitor
Name:
BDBM50123992
Synonyms:
3-Cyclopropylmethyl-6-ethyl-11-methyl-8-phenylamino-3,4,5,6-tetrahydro-2H-2,6-methano-benzo[d]azocin-1-one | CHEMBL352965
Type:
Small organic molecule
Emp. Form.:
C25H30N2O
Mol. Mass.:
374.5185
SMILES:
CC[C@]12CCN(CC3CC3)C([C@@H]1C)C(=O)c1ccc(Nc3ccccc3)cc21
: