Target
Kappa-type opioid receptor
Ligand
BDBM50123985
Substrate
Meas. Tech.
ChEMBL_146518 (CHEMBL882417)
Ki
1±n/a nM
Citation
 Wentland, MPYe, YCioffi, CLLou, RZhou, QXu, GDuan, WDehnhardt, CMSun, XCohen, DJBidlack, JM Syntheses and opioid receptor binding affinities of 8-amino-2,6-methano-3-benzazocines. J Med Chem 46:838-49 (2003)  
Target
Name:
Kappa-type opioid receptor
Synonyms:
Kappa Opioid Receptor OPRK1 Opiate Kappa 1 | mu/kappa opioid receptor
Type:
G Protein-Coupled Receptor (GPCR)
Mol. Mass.:
42744.99
Organism:
Cavia porcellus (domestic guinea pig)
Description:
P41144
Residue:
380
  
Inhibitor
Name:
BDBM50123985
Synonyms:
3-Cyclopropylmethyl-8-hydroxy-6,11-dimethyl-3,4,5,6-tetrahydro-2H-2,6-methano-benzo[d]azocin-1-one | CHEMBL354172
Type:
Small organic molecule
Emp. Form.:
C18H23NO2
Mol. Mass.:
285.3807
SMILES:
C[C@H]1C2N(CC3CC3)CC[C@]1(C)c1cc(O)ccc1C2=O
: