Target
Growth factor receptor-bound protein 2
Ligand
BDBM50124291
Substrate
Meas. Tech.
ChEBML_72365
IC50
8.3±n/a nM
Citation
 Li, PPeach, MLZhang, MLiu, HYang, DNicklaus, MRoller, PP Structure-based design of thioether-bridged cyclic phosphopeptides binding to Grb2-SH2 domain. Bioorg Med Chem Lett 13:895-9 (2003)  
Target
Name:
Growth factor receptor-bound protein 2
Synonyms:
ASH GRB2 adapter protein Grb2-SH2 | Growth factor receptor-bound protein 2
Type:
Protein
Mol. Mass.:
25205.04
Organism:
Homo sapiens (Human)
Description:
P62993
Residue:
217
  
Inhibitor
Name:
BDBM50124291
Synonyms:
3-[17-carbamoyl-32-carbamoylmethyl-20-(4-hydroxybenzyl)-7-isobutyl-29-isopropyl-4-(4-phosphonooxybenzyl)-23-(2-methylsulfanylethyl)-3,6,9,13,19,22,25,28,31,34-decaoxo-15-thia-2,5,8,12,18,21,24,27,30,33-decaazacyclotetratriacontanyl]propanoic acid | CHEMBL216415
Type:
Small organic molecule
Emp. Form.:
C53H77N12O19PS2
Mol. Mass.:
1281.351
SMILES:
CSCC[C@@H]1NC(=O)CNC(=O)[C@@H](NC(=O)[C@H](CC(N)=O)NC(=O)[C@H](CCC(O)=O)NC(=O)[C@H](Cc2ccc(OP(O)(O)=O)cc2)NC(=O)[C@H](CC(C)C)NC(=O)CCNC(=O)CSC[C@H](NC(=O)[C@H](Cc2ccc(O)cc2)NC1=O)C(N)=O)C(C)C
: