Target
5'-nucleotidase
Ligand
BDBM50527135
Substrate
Meas. Tech.
ChEMBL_2076136 (CHEMBL4731670)
Ki
0.381000±n/a nM
Citation
 Schmies, CCRolshoven, GIdris, RMLosenkova, KRenn, CSchäkel, LAl-Hroub, HWang, YGarofano, FSchmidt-Wolf, IGHZimmermann, HYegutkin, GGMüller, CE Fluorescent Probes for Ecto-5'-nucleotidase (CD73). ACS Med Chem Lett 11:2253-2260 (2020)  
Target
Name:
5'-nucleotidase
Synonyms:
5'-NT 5NTD_HUMAN Ecto-5'-nucleotidase NT5 NTE
Type:
Enzyme
Mol. Mass.:
63371.54
Organism:
Homo sapiens (Human)
Description:
P21589
Residue:
574
  
Inhibitor
Name:
BDBM50527135
Synonyms:
CHEMBL4452072
Type:
Small organic molecule
Emp. Form.:
C19H24ClN5O9P2
Mol. Mass.:
563.822
SMILES:
CN(Cc1ccccc1)c1nc(Cl)nc2n(cnc12)[C@@H]1O[C@H](COP(O)(=O)CP(O)(O)=O)[C@@H](O)[C@H]1O
: