Target
C-C chemokine receptor type 2
Ligand
BDBM50563422
Substrate
Meas. Tech.
ChEMBL_2082484 (CHEMBL4738275)
Ki
6.3±n/a nM
Citation
 Ortiz Zacarķas, NVChahal, KK?imkovį, Tvan der Horst, CZheng, YInoue, ATheunissen, EMallee, Lvan der Es, DLouvel, JIJzerman, APHandel, TMKufareva, IHeitman, LH Design and Characterization of an Intracellular Covalent Ligand for CC Chemokine Receptor 2. J Med Chem 64:2608-2621 (2021)  
Target
Name:
C-C chemokine receptor type 2
Synonyms:
C-C chemokine receptor type 2 (CCR2) CCR2_HUMAN Chemoattractant Cytokine Receptor 2 (CCR2) Monocyte chemotactic protein-1 (MCP-1)
Type:
Enzyme
Mol. Mass.:
41932.32
Organism:
Homo sapiens (Human)
Description:
P41597
Residue:
374
  
Inhibitor
Name:
BDBM50563422
Synonyms:
CHEMBL4760108
Type:
Small organic molecule
Emp. Form.:
C19H12Cl3NO5S
Mol. Mass.:
472.726
SMILES:
OC(=O)c1ccc(Oc2ccc(Cl)cc2NS(=O)(=O)c2ccc(Cl)c(Cl)c2)cc1
: