Target
C-C chemokine receptor type 2
Ligand
BDBM50563425
Substrate
Meas. Tech.
ChEMBL_2082484 (CHEMBL4738275)
Ki
63.1±n/a nM
Citation
 Ortiz Zacarķas, NVChahal, KK?imkovį, Tvan der Horst, CZheng, YInoue, ATheunissen, EMallee, Lvan der Es, DLouvel, JIJzerman, APHandel, TMKufareva, IHeitman, LH Design and Characterization of an Intracellular Covalent Ligand for CC Chemokine Receptor 2. J Med Chem 64:2608-2621 (2021)  
Target
Name:
C-C chemokine receptor type 2
Synonyms:
C-C chemokine receptor type 2 (CCR2) CCR2_HUMAN Chemoattractant Cytokine Receptor 2 (CCR2) Monocyte chemotactic protein-1 (MCP-1)
Type:
Enzyme
Mol. Mass.:
41932.32
Organism:
Homo sapiens (Human)
Description:
P41597
Residue:
374
  
Inhibitor
Name:
BDBM50563425
Synonyms:
CHEMBL4795646
Type:
Small organic molecule
Emp. Form.:
C29H21Cl2F4N3O7S2
Mol. Mass.:
734.523
SMILES:
FC(F)(F)c1cc(ccc1Cl)S(=O)(=O)Nc1cc(Cl)ccc1Oc1ccc(cc1)C(=O)NCCNC(=O)c1ccc(cc1)S(F)(=O)=O
: