Target
C-C chemokine receptor type 2
Ligand
BDBM50563426
Substrate
Meas. Tech.
ChEMBL_2082484 (CHEMBL4738275)
Ki
4.0±n/a nM
Citation
 Ortiz Zacarķas, NVChahal, KK?imkovį, Tvan der Horst, CZheng, YInoue, ATheunissen, EMallee, Lvan der Es, DLouvel, JIJzerman, APHandel, TMKufareva, IHeitman, LH Design and Characterization of an Intracellular Covalent Ligand for CC Chemokine Receptor 2. J Med Chem 64:2608-2621 (2021)  
Target
Name:
C-C chemokine receptor type 2
Synonyms:
C-C chemokine receptor type 2 (CCR2) CCR2_HUMAN Chemoattractant Cytokine Receptor 2 (CCR2) Monocyte chemotactic protein-1 (MCP-1)
Type:
Enzyme
Mol. Mass.:
41932.32
Organism:
Homo sapiens (Human)
Description:
P41597
Residue:
374
  
Inhibitor
Name:
BDBM50563426
Synonyms:
CHEMBL4783861
Type:
Small organic molecule
Emp. Form.:
C23H16Cl2F3N3O4S2
Mol. Mass.:
590.422
SMILES:
FC(F)(F)c1cc(ccc1Cl)S(=O)(=O)Nc1cc(Cl)ccc1Oc1ccc(cc1)C(=O)NCCSC#N
: