Target
Nischarin
Ligand
BDBM50127599
Substrate
Meas. Tech.
ChEMBL_220576 (CHEMBL874098)
Ki
23±n/a nM
Citation
 Touzeau, FArrault, AGuillaumet, GScalbert, EPfeiffer, BRettori, MCRenard, PMérour, JY Synthesis and biological evaluation of new 2-(4,5-dihydro-1H-imidazol-2-yl)-3,4-dihydro-2H-1,4-benzoxazine derivatives. J Med Chem 46:1962-79 (2003)  
Target
Name:
Nischarin
Synonyms:
IRAS Imidazoline receptor 1 (I1R) NISCH Nischarin
Type:
Enzyme
Mol. Mass.:
166571.31
Organism:
Homo sapiens (Human)
Description:
Q9Y2I1
Residue:
1504
  
Inhibitor
Name:
BDBM50127599
Synonyms:
2-(4,5-Dihydro-1H-imidazol-2-yl)-4,8-dimethyl-3,4-dihydro-2H-benzo[1,4]oxazine | CHEMBL13958
Type:
Small organic molecule
Emp. Form.:
C13H17N3O
Mol. Mass.:
231.2936
SMILES:
CN1CC(Oc2c(C)cccc12)C1=NCCN1
: