Target
Peroxisome proliferator-activated receptor alpha
Ligand
BDBM28681
Substrate
Meas. Tech.
ChEMBL_154543 (CHEMBL760262)
EC50
>3000±n/a nM
Citation
 Koyama, HBoueres, JKHan, WMetzger, EJBergman, JPGratale, DFMiller, DJTolman, RLMacNaul, KLBerger, JPDoebber, TWLeung, KMoller, DEHeck, JVSahoo, SP 5-Aryl thiazolidine-2,4-diones as selective PPARgamma agonists. Bioorg Med Chem Lett 13:1801-4 (2003)  
Target
Name:
Peroxisome proliferator-activated receptor alpha
Synonyms:
NR1C1 PPAR PPAR-alpha PPARA_HUMAN Peroxisome proliferator-activated receptor | Peroxisome proliferator-activated receptor alpha (PPAR alpha)
Type:
Enzyme
Mol. Mass.:
52222.08
Organism:
Homo sapiens (Human)
Description:
Q07869
Residue:
468
  
Inhibitor
Name:
BDBM28681
Synonyms:
5-[(4-{2-[methyl(pyridin-2-yl)amino]ethoxy}phenyl)methyl]-1,3-thiazolidine-2,4-dione BRL 49653 CHEMBL121 [3H]rosiglitazone rosiglitazone
Type:
radiolabeled ligand
Emp. Form.:
C18H19N3O3S
Mol. Mass.:
357.427
SMILES:
CN(CCOc1ccc(Cc2sc(=O)[nH]c2O)cc1)c1ccccn1
: