Target
Peroxisome proliferator-activated receptor gamma/Retinoic acid receptor RXR-alpha
Ligand
BDBM50204012
Substrate
Meas. Tech.
ChEMBL_2085052 (CHEMBL4766315)
EC50
>10000±n/a nM
Citation
 Hamdouchi, CKahl, SDPatel Lewis, ACardona, GRZink, RWChen, KEessalu, TEFicorilli, JVMarcelo, MCOtto, KAWilbur, KLLineswala, JPPiper, JLCoffey, DSSweetana, SAHaas, JVBrooks, DAPratt, EJBelin, RMDeeg, MAMa, XCannady, EAJohnson, JTYumibe, NPChen, QMaiti, PMontrose-Rafizadeh, CChen, YReifel Miller, A The Discovery, Preclinical, and Early Clinical Development of Potent and Selective GPR40 Agonists for the Treatment of Type 2 Diabetes Mellitus (LY2881835, LY2922083, and LY2922470). J Med Chem 59:10891-10916 (2016)  
Target
Name:
Peroxisome proliferator-activated receptor gamma/Retinoic acid receptor RXR-alpha
Synonyms:
Peroxisome Proliferator-Activated Receptor gamma/Retinoid X receptor alpha | RXR alpha/PPAR gamma
Type:
Mol. Mass.:
Description:
ASSAY_ID of EBI is 43803
Components:
This complex has 3 components.
Component 1
Name:
Peroxisome proliferator-activated receptor gamma
Synonyms:
NR1C3 PPAR-gamma PPARG_HUMAN Peroxisome proliferator-activated receptor gamma (PPAR gamma) Peroxisome proliferator-activated receptor gamma (PPARĪ³) peroxisome proliferator-activated receptor gamma isoform 2
Type:
Nuclear Receptor
Mol. Mass.:
57613.46
Organism:
Homo sapiens (Human)
Description:
P37231
Residue:
505
  
Component 2
Name:
Retinoic acid receptor RXR-alpha
Synonyms:
NR2B1 Nuclear receptor subfamily 4 group A member 2 RXRA Retinoic acid receptor RXR-alpha/gamma Retinoid receptor
Type:
PROTEIN
Mol. Mass.:
50820.38
Organism:
Homo sapiens (Human)
Description:
ChEMBL_1456363
Residue:
462
  
Inhibitor
Name:
BDBM50204012
Synonyms:
CHEMBL3955132
Type:
Small organic molecule
Emp. Form.:
C28H29NO4S
Mol. Mass.:
475.599
SMILES:
COc1cccc2CCCN(Cc3ccc(COc4ccc(cc4)[C@H](CC(O)=O)C#CC)s3)c12
: