Target
Egl nine homolog 1
Ligand
BDBM50563889
Substrate
Meas. Tech.
ChEMBL_2085159 (CHEMBL4766422)
IC50
1.000000±n/a nM
Citation
 Debenham, JSMadsen-Duggan, CClements, MJWalsh, TFKuethe, JTReibarkh, MSalowe, SPSonatore, LMHajdu, RMilligan, JAVisco, DMZhou, DLingham, RBStickens, DDeMartino, JATong, XWolff, MPang, JMiller, RRSherer, ECHale, JJ Discovery of N-[Bis(4-methoxyphenyl)methyl]-4-hydroxy-2-(pyridazin-3-yl)pyrimidine-5-carboxamide (MK-8617), an Orally Active Pan-Inhibitor of Hypoxia-Inducible Factor Prolyl Hydroxylase 1-3 (HIF PHD1-3) for the Treatment of Anemia. J Med Chem 59:11039-11049 (2016)  
Target
Name:
Egl nine homolog 1
Synonyms:
C1orf12 EGLN1_HUMAN Hypoxia-inducible factor prolyl hydroxylase 2 (HIF-PH2) Prolyl hydroxylase domain-containing protein 2 (PHD2)
Type:
Protein
Mol. Mass.:
46035.59
Organism:
Homo sapiens (Human)
Description:
Q9GZT9
Residue:
426
  
Inhibitor
Name:
BDBM50563889
Synonyms:
CHEMBL4783524
Type:
Small organic molecule
Emp. Form.:
C24H21N5O4
Mol. Mass.:
443.4546
SMILES:
COc1ccc(cc1)C(NC(=O)c1cnc(nc1O)-c1cccnn1)c1ccc(OC)cc1
: