Target
Cyclin-dependent kinase 4/G1/S-specific cyclin-D3
Ligand
BDBM50110183
Substrate
Meas. Tech.
ChEMBL_2087320 (CHEMBL4768583)
IC50
1.8±n/a nM
Citation
 Shi, CWang, QLiao, XGe, HHuo, GZhang, LChen, NZhai, XHong, YWang, LWang, ZShi, WMao, YYu, JKe, YXia, G Discovery of a novel series of imidazo[1',2':1,6]pyrido[2,3-d]pyrimidin derivatives as potent cyclin-dependent kinase 4/6 inhibitors. Eur J Med Chem 193:0 (2020)  
Target
Name:
Cyclin-dependent kinase 4/G1/S-specific cyclin-D3
Synonyms:
CDK4/Cyclin D3
Type:
Mol. Mass.:
Description:
ASSAY_ID of ChEMBL is 1806445
Components:
This complex has 2 components.
Component 1
Name:
Cyclin-dependent kinase 4
Synonyms:
CDK4 Cell division protein kinase 4 PSK-J3
Type:
Enzyme Subunit
Mol. Mass.:
33731.96
Organism:
Homo sapiens (Human)
Description:
P11802
Residue:
303
  
Component 2
Name:
G1/S-specific cyclin-D3
Synonyms:
CCND3 | CCND3_HUMAN
Type:
Enzyme
Mol. Mass.:
32521.90
Organism:
Homo sapiens (Human)
Description:
P30281
Residue:
292
  
Inhibitor
Name:
BDBM50110183
Synonyms:
Abemaciclib US10626107, Example LY2835219 US10696678, Example LY2835219 US11053238, LY2835219 US11351170, Example Abemaciclib
Type:
Small organic molecule
Emp. Form.:
C27H32F2N8
Mol. Mass.:
506.5934
SMILES:
CCN1CCN(Cc2ccc(Nc3ncc(F)c(n3)-c3cc(F)c4nc(C)n(C(C)C)c4c3)nc2)CC1
: