Target
Retinoic acid receptor gamma
Ligand
BDBM28681
Substrate
Meas. Tech.
ChEMBL_196008 (CHEMBL797872)
Ki
10000±n/a nM
Citation
 Michellys, PYArdecky, RJChen, JHCrombie, DLEtgen, GJFaul, MMFaulkner, ALGrese, TAHeyman, RAKaranewsky, DSKlausing, KLeibowitz, MDLiu, SMais, DAMapes, CMMarschke, KBReifel-Miller, AOgilvie, KMRungta, DThompson, AWTyhonas, JSBoehm, MF Novel (2E,4E,6Z)-7-(2-alkoxy-3,5-dialkylbenzene)-3-methylocta-2,4,6-trienoic acid retinoid X receptor modulators are active in models of type 2 diabetes. J Med Chem 46:2683-96 (2003)  
Target
Name:
Retinoic acid receptor gamma
Synonyms:
NR1B3 RAR-gamma RARG_HUMAN Retinoic acid receptor gamma | Retinoid receptor
Type:
PROTEIN
Mol. Mass.:
50345.43
Organism:
Homo sapiens (Human)
Description:
ChEMBL_1458016
Residue:
454
  
Inhibitor
Name:
BDBM28681
Synonyms:
5-[(4-{2-[methyl(pyridin-2-yl)amino]ethoxy}phenyl)methyl]-1,3-thiazolidine-2,4-dione BRL 49653 CHEMBL121 [3H]rosiglitazone rosiglitazone
Type:
radiolabeled ligand
Emp. Form.:
C18H19N3O3S
Mol. Mass.:
357.427
SMILES:
CN(CCOc1ccc(Cc2sc(=O)[nH]c2O)cc1)c1ccccn1
: