Target
5-hydroxytryptamine receptor 1F
Ligand
BDBM50130451
Substrate
Meas. Tech.
ChEMBL_2087 (CHEMBL616730)
Ki
7.7±n/a nM
Citation
 Filla, SAMathes, BMJohnson, KWPhebus, LACohen, MLNelson, DLZgombick, JMErickson, JASchenck, KWWainscott, DBBranchek, TASchaus, JM Novel potent 5-HT(1F) receptor agonists: structure-activity studies of a series of substituted N-[3-(1-methyl-4-piperidinyl)-1H-pyrrolo[3,2-b]pyridin-5-yl]amides. J Med Chem 46:3060-71 (2003)  
Target
Name:
5-hydroxytryptamine receptor 1F
Synonyms:
5-HT-1F 5-hydroxytryptamine receptor 1F HTR1EL Serotonin (5-HT) receptor Serotonin receptor 1F
Type:
Enzyme Catalytic Domain
Mol. Mass.:
41724.68
Organism:
Homo sapiens (Human)
Description:
5-HT1F HTR1F HUMAN::P30939
Residue:
366
  
Inhibitor
Name:
BDBM50130451
Synonyms:
CHEMBL104692 | N-[3-(1-Methyl-piperidin-4-yl)-1H-pyrrolo[3,2-b]pyridin-5-yl]-4-nitro-benzamide
Type:
Small organic molecule
Emp. Form.:
C20H21N5O3
Mol. Mass.:
379.4124
SMILES:
CN1CCC(CC1)c1c[nH]c2ccc(NC(=O)c3ccc(cc3)[N+]([O-])=O)nc12
: