Target
Melanocortin receptor 3
Ligand
BDBM50565825
Substrate
Meas. Tech.
ChEMBL_2093916 (CHEMBL4775179)
Ki
0.021878±n/a nM
Citation
 Martin, CGimenez, LEWilliams, SYJing, YWu, YHollanders, CVan der Poorten, OGonzalez, SVan Holsbeeck, KPreviti, SLamouroux, AZhao, STourwé, DStevens, RCCone, RDBallet, S Structure-Based Design of Melanocortin 4 Receptor Ligands Based on the SHU-9119-hMC4R Cocrystal Structure?. J Med Chem 64:357-369 (2021)  
Target
Name:
Melanocortin receptor 3
Synonyms:
MC3-R MC3R_HUMAN Melanocortin receptor (M3 and M4)
Type:
Enzyme
Mol. Mass.:
36044.86
Organism:
Homo sapiens (Human)
Description:
P41968
Residue:
323
  
Inhibitor
Name:
BDBM50565825
Synonyms:
CHEMBL4777048
Type:
Small organic molecule
Emp. Form.:
C54H70ClN15O9
Mol. Mass.:
1108.682
SMILES:
CCCC[C@H](NC(C)=O)C(=O)N[C@H]1CC(=O)NCCCC[C@H](NC(=O)[C@H](Cc2c[nH]c3cc(Cl)ccc23)NC(=O)[C@H](CCCNC(N)=N)NC(=O)[C@@H](Cc2ccc3ccccc3c2)NC(=O)[C@H](Cc2cnc[nH]2)NC1=O)C(N)=O
: