Target
NACHT, LRR and PYD domains-containing protein 3
Ligand
BDBM50155926
Substrate
Meas. Tech.
ChEMBL_2094017 (CHEMBL4775280)
IC50
8.1±n/a nM
Citation
 Dai, ZChen, XYAn, LYLi, CCZhao, NYang, FYou, STHou, CZLi, KJiang, CYou, QDDi, BXu, LL Development of Novel Tetrahydroquinoline Inhibitors of NLRP3 Inflammasome for Potential Treatment of DSS-Induced Mouse Colitis. J Med Chem 64:871-889 (2021)  
Target
Name:
NACHT, LRR and PYD domains-containing protein 3
Synonyms:
C1orf7 NALP3 NLRP3 protein PYPAF1
Type:
Enzyme Catalytic Domain
Mol. Mass.:
118173.88
Organism:
Homo sapiens (Human)
Description:
Q96P20
Residue:
1036
  
Inhibitor
Name:
BDBM50155926
Synonyms:
CHEMBL3183703
Type:
Small organic molecule
Emp. Form.:
C20H24N2O5S
Mol. Mass.:
404.48
SMILES:
CC(C)(O)c1coc(c1)S(=O)(=O)NC(=O)Nc1c2CCCc2cc2CCCc12
: