Target
Apelin receptor
Ligand
BDBM50566303
Substrate
Meas. Tech.
ChEMBL_2099903 (CHEMBL4808299)
Ki
0.080000±n/a nM
Citation
 Trân, KVan Den Hauwe, RSainsily, XCouvineau, PCôté, JSimard, LEchevarria, MMurza, ASerre, AThéroux, LSaibi, SHaroune, LLongpré, JMLesur, OAuger-Messier, MSpino, CBouvier, MSarret, PBallet, SMarsault, É Constraining the Side Chain of C-Terminal Amino Acids in Apelin-13 Greatly Increases Affinity, Modulates Signaling, and Improves the Pharmacokinetic Profile. J Med Chem 64:5345-5364 (2021)  
Target
Name:
Apelin receptor
Synonyms:
AGTRL1 APJ_HUMAN Angiotensin receptor-like 1 Apelin receptor (APJ) G-protein coupled receptor HG11
Type:
Enzyme Catalytic Domain
Mol. Mass.:
42664.06
Organism:
Homo sapiens (Human)
Description:
P35414
Residue:
380
  
Inhibitor
Name:
BDBM50566303
Synonyms:
CHEMBL4867913
Type:
Small organic molecule
Emp. Form.:
C77H113N23O16
Mol. Mass.:
1616.8656
SMILES:
CCCC[C@H](NC(=O)[C@@H]1CCCN1C(=O)CNC(=O)[C@H](CCCCN)NC(=O)[C@H](Cc1cnc[nH]1)NC(=O)[C@H](CO)NC(=O)[C@H](CC(C)C)NC(=O)[C@H](CCCNC(N)=N)NC(=O)[C@@H]1CCCN1C(=O)[C@H](CCCNC(N)=N)NC(=O)[C@@H]1CCC(=O)N1)C(=O)N[C@H]1Cc2c(CN([C@H](Cc3ccccc3)C(O)=O)C1=O)[nH]c1ccccc21
: