Target
Androgen receptor
Ligand
BDBM50131269
Substrate
Meas. Tech.
ChEBML_36132
Kd
1.4±n/a nM
Citation
 Ishioka, TTanatani, ANagasawa, KHashimoto, Y Anti-androgens with full antagonistic activity toward human prostate tumor LNCaP cells with mutated androgen receptor. Bioorg Med Chem Lett 13:2655-8 (2003)  
Target
Name:
Androgen receptor
Synonyms:
ANDR_HUMAN Androgen Receptor Androgen receptor/Baculoviral IAP repeat-containing protein 2 Dihydrotestosterone receptor Nuclear receptor subfamily 3 group C member 4
Type:
Receptor
Mol. Mass.:
99185.27
Organism:
Homo sapiens (Human)
Description:
CHO cells were stably transfected with human AR gene.
Residue:
920
  
Inhibitor
Name:
BDBM50131269
Synonyms:
3-(2-Fluoro-phenyl)-4-[1-(4-pyrrolidin-1-yl-phenyl)-meth-(Z)-ylidene]-4H-isoxazol-5-one | CHEMBL89437
Type:
Small organic molecule
Emp. Form.:
C20H17FN2O2
Mol. Mass.:
336.3596
SMILES:
Fc1ccccc1C1=NOC(=O)\C1=C/c1ccc(cc1)N1CCCC1
: