Target
Mitogen-activated protein kinase 14
Ligand
BDBM14839
Substrate
Meas. Tech.
ChEMBL_124492 (CHEMBL733328)
Kd
0.097000±n/a nM
Citation
 Regan, JPargellis, CACirillo, PFGilmore, THickey, ERPeet, GWProto, ASwinamer, AMoss, N The kinetics of binding to p38MAP kinase by analogues of BIRB 796. Bioorg Med Chem Lett 13:3101-4 (2003)  
Target
Name:
Mitogen-activated protein kinase 14
Synonyms:
CSAID-binding protein CSBP1 CSPB1 MAP kinase 14 MAP kinase p38 alpha MAPK14 MK14_HUMAN Mitogen-activated protein kinase p38 alpha Stress-activated protein kinase 2a | p38 MAP kinase alpha/beta
Type:
Serine/threonine-protein kinase
Mol. Mass.:
41286.76
Organism:
Homo sapiens (Human)
Description:
Q16539
Residue:
360
  
Inhibitor
Name:
BDBM14839
Synonyms:
1-(5-tert-Butyl-2-phenyl-2H-pyrazol-3-yl)-3-[4-(2-morpholin-4-yl-ethoxy)-naphthalen-1-yl]-urea BIRB-796 Analog 33 diaryl urea compound 8
Type:
Small organic molecule
Emp. Form.:
C30H35N5O3
Mol. Mass.:
513.6306
SMILES:
CC(C)(C)c1cc(NC(=O)Nc2ccc(OCCN3CCOCC3)c3ccccc23)n(n1)-c1ccccc1
: