Target
Peroxisome proliferator-activated receptor gamma/Retinoic acid receptor RXR-alpha
Ligand
BDBM50132585
Substrate
Meas. Tech.
ChEMBL_164867 (CHEMBL772126)
EC50
143±n/a nM
Citation
 Gernert, DLAjamie, RArdecky, RABell, MGLeibowitz, MDMais, DAMapes, CMMichellys, PYRungta, DReifel-Miller, ATyhonas, JSYumibe, NGrese, TA Design and synthesis of fluorinated RXR modulators. Bioorg Med Chem Lett 13:3191-5 (2003)  
Target
Name:
Peroxisome proliferator-activated receptor gamma/Retinoic acid receptor RXR-alpha
Synonyms:
Peroxisome Proliferator-Activated Receptor gamma/Retinoid X receptor alpha | RXR alpha/PPAR gamma
Type:
Mol. Mass.:
Description:
ASSAY_ID of EBI is 43803
Components:
This complex has 3 components.
Component 1
Name:
Peroxisome proliferator-activated receptor gamma
Synonyms:
NR1C3 PPAR-gamma PPARG_HUMAN Peroxisome proliferator-activated receptor gamma (PPAR gamma) Peroxisome proliferator-activated receptor gamma (PPARĪ³) peroxisome proliferator-activated receptor gamma isoform 2
Type:
Nuclear Receptor
Mol. Mass.:
57613.46
Organism:
Homo sapiens (Human)
Description:
P37231
Residue:
505
  
Component 2
Name:
Retinoic acid receptor RXR-alpha
Synonyms:
NR2B1 Nuclear receptor subfamily 4 group A member 2 RXRA Retinoic acid receptor RXR-alpha/gamma Retinoid receptor
Type:
PROTEIN
Mol. Mass.:
50820.38
Organism:
Homo sapiens (Human)
Description:
ChEMBL_1456363
Residue:
462
  
Inhibitor
Name:
BDBM50132585
Synonyms:
(2E,4Z,6Z)-7-[3,5-Di-tert-butyl-2-(2,2-difluoro-ethoxy)-phenyl]-4-fluoro-3-methyl-octa-2,4,6-trienoic acid | CHEMBL326673
Type:
Small organic molecule
Emp. Form.:
C25H33F3O3
Mol. Mass.:
438.5229
SMILES:
C\C(=C/C(O)=O)\C(\F)=C\C=C(\C)c1cc(cc(c1OCC(F)F)C(C)(C)C)C(C)(C)C
: