Target
Carbonic anhydrase 7
Ligand
BDBM50511590
Substrate
Meas. Tech.
ChEMBL_2104707 (CHEMBL4813210)
Ki
0.760000±n/a nM
Citation
 Angeli, APinteala, MMaier, SSToti, ADi Cesare Mannelli, LGhelardini, CSelleri, SCarta, FSupuran, CT Tellurides bearing benzensulfonamide as carbonic anhydrase inhibitors with potent antitumor activity. Bioorg Med Chem Lett 45:0 (2021)  
Target
Name:
Carbonic anhydrase 7
Synonyms:
CA-VII CAH7_HUMAN Carbonic anhydrase Carbonic anhydrase VII (CA VII)
Type:
Enzyme
Mol. Mass.:
29664.11
Organism:
Homo sapiens (Human)
Description:
Human cloned isozyme.
Residue:
264
  
Inhibitor
Name:
BDBM50511590
Synonyms:
CHEMBL4587627
Type:
Small organic molecule
Emp. Form.:
C14H15NO2STe
Mol. Mass.:
388.9
SMILES:
[#6]-c1ccccc1[Te;v2][#6]-c1ccc(cc1)S([#7])(=O)=O
: