Target
Tyrosine-protein kinase BTK
Ligand
BDBM50568218
Substrate
Meas. Tech.
ChEMBL_2104831 (CHEMBL4813334)
IC50
4760±n/a nM
Citation
 Guilinger, JPArchna, AAugustin, MBergmann, ACentrella, PAClark, MACuozzo, JWDäther, MGuié, MAHabeshian, SKiefersauer, RKrapp, SLammens, ALercher, LLiu, JLiu, YMaskos, KMrosek, MPflügler, KSiegert, MThomson, HATian, XZhang, YKonz Makino, DLKeefe, AD Novel irreversible covalent BTK inhibitors discovered using DNA-encoded chemistry. Bioorg Med Chem 42:0 (2021)  
Target
Name:
Tyrosine-protein kinase BTK
Synonyms:
AGMX1 Agammaglobulinaemia tyrosine kinase B cell progenitor kinase BPK BTK_HUMAN Tyrosine Kinase BTK Tyrosine-protein kinase BTK (BTK)
Type:
Enzyme
Mol. Mass.:
76289.95
Organism:
Homo sapiens (Human)
Description:
Q06187
Residue:
659
  
Inhibitor
Name:
BDBM50568218
Synonyms:
CHEMBL4859382
Type:
Small organic molecule
Emp. Form.:
C23H28N4O3
Mol. Mass.:
408.4934
SMILES:
CNC(=O)[C@H]1Cc2c(CN1C(=O)C[C@H]1CCCN(C1)C(=O)C=C)[nH]c1ccccc21
: