Target
Tyrosine-protein kinase BTK
Ligand
BDBM50568222
Substrate
Meas. Tech.
ChEMBL_2104831 (CHEMBL4813334)
IC50
84±n/a nM
Citation
 Guilinger, JPArchna, AAugustin, MBergmann, ACentrella, PAClark, MACuozzo, JWDäther, MGuié, MAHabeshian, SKiefersauer, RKrapp, SLammens, ALercher, LLiu, JLiu, YMaskos, KMrosek, MPflügler, KSiegert, MThomson, HATian, XZhang, YKonz Makino, DLKeefe, AD Novel irreversible covalent BTK inhibitors discovered using DNA-encoded chemistry. Bioorg Med Chem 42:0 (2021)  
Target
Name:
Tyrosine-protein kinase BTK
Synonyms:
AGMX1 Agammaglobulinaemia tyrosine kinase B cell progenitor kinase BPK BTK_HUMAN Tyrosine Kinase BTK Tyrosine-protein kinase BTK (BTK)
Type:
Enzyme
Mol. Mass.:
76289.95
Organism:
Homo sapiens (Human)
Description:
Q06187
Residue:
659
  
Inhibitor
Name:
BDBM50568222
Synonyms:
CHEMBL4867490
Type:
Small organic molecule
Emp. Form.:
C22H22N4O4
Mol. Mass.:
406.4345
SMILES:
CNC(=O)[C@@H](Cc1ccc(cc1)C#N)NC(=O)[C@@H](NC(=O)[C@@H]1CO1)c1ccccc1
: