Target
Genome polyprotein
Ligand
BDBM50126664
Substrate
Meas. Tech.
ChEBML_164125
IC50
31000±n/a nM
Citation
 Reddy, TJChan, LTurcotte, NProulx, MPereira, OZDas, SKSiddiqui, AWang, WPoisson, CYannopoulos, CGBilimoria, DL'Heureux, LAlaoui, HMNguyen-Ba, N Further SAR studies on novel small molecule inhibitors of the hepatitis C (HCV) NS5B polymerase. Bioorg Med Chem Lett 13:3341-4 (2003)  
Target
Name:
Genome polyprotein
Synonyms:
Genome polyprotein Hepatitis C virus polyprotein RNA-dependent RNA polymerase (NS5B)
Type:
Protein
Mol. Mass.:
327266.82
Organism:
Hepatitis C virus (HCV)
Description:
P26664
Residue:
3011
  
Inhibitor
Name:
BDBM50126664
Synonyms:
(S)-2-[(3-Bromo-benzyl)-(2-chloro-benzoyl)-amino]-3-phenyl-propionic acid CHEMBL280721
Type:
Small organic molecule
Emp. Form.:
C23H19BrClNO3
Mol. Mass.:
472.759
SMILES:
OC(=O)[C@H](Cc1ccccc1)N(Cc1cccc(Br)c1)C(=O)c1ccccc1Cl
: