Target
Dihydroorotate dehydrogenase (quinone), mitochondrial
Ligand
BDBM50054601
Substrate
Meas. Tech.
ChEMBL_2104887 (CHEMBL4813390)
IC50
800±n/a nM
Citation
 Petrovi?, MMRoschger, CChaudary, SZierer, AMladenovi?, MMarkovi?, VTrifunovi?, SJoksovi?, MD Low cytotoxic quinoline-4-carboxylic acids derived from vanillin precursors as potential human dihydroorotate dehydrogenase inhibitors. Bioorg Med Chem Lett 46:0 (2021)  
Target
Name:
Dihydroorotate dehydrogenase (quinone), mitochondrial
Synonyms:
DHODH Dihydroorotate dehydrogenase Dihydroorotate dehydrogenase, mitochondrial Dihydroorotate oxidase (DHODH) | PYRD_HUMAN
Type:
Enzyme
Mol. Mass.:
42881.33
Organism:
Homo sapiens (Human)
Description:
Q02127
Residue:
395
  
Inhibitor
Name:
BDBM50054601
Synonyms:
5-Methyl-N-(4-(trifluoromethyl)phenyl)-4-isoxazolecarboxamide 5-methyl-N-[4-(trifluoromethyl)phenyl]-1,2-oxazole-4-carboxamide CHEMBL960 alpha,alpha,alpha-Trifluoro-5-methyl-4-isoxazolecarboxy-p-toluidide
Type:
Small organic molecule
Emp. Form.:
C12H9F3N2O2
Mol. Mass.:
270.2073
SMILES:
Cc1oncc1C(=O)Nc1ccc(cc1)C(F)(F)F
: