Target
Transthyretin
Ligand
BDBM32021
Substrate
Meas. Tech.
ChEMBL_2105310 (CHEMBL4813813)
IC50
12000±n/a nM
Citation
 Kitakami, RInui, KNakagawa, YSawai, YKatayama, WYokoyama, TOkada, TKanamitsu, KNakagawa, SToyooka, NMizuguchi, M Inhibitory activities of anthraquinone and xanthone derivatives against transthyretin amyloidogenesis. Bioorg Med Chem 44:0 (2021)  
Target
Name:
Transthyretin
Synonyms:
ATTR Prealbumin TTHY_HUMAN Transthyretin (TTR)
Type:
Enzyme
Mol. Mass.:
15884.31
Organism:
Homo sapiens (Human)
Description:
P02766
Residue:
147
  
Inhibitor
Name:
BDBM32021
Synonyms:
4,5-bis(oxidanyl)-9,10-bis(oxidanylidene)anthracene-2-carboxylic acid 4,5-dihydroxy-9,10-dioxo-2-anthracenecarboxylic acid MLS000069639 SMR000058210 US9238626, Rhein | cid_10168
Type:
Small organic molecule
Emp. Form.:
C15H8O6
Mol. Mass.:
284.2204
SMILES:
OC(=O)c1cc(O)c2C(=O)c3c(O)cccc3C(=O)c2c1
: