Target
Dual specificity mitogen-activated protein kinase kinase 4
Ligand
BDBM50568580
Substrate
Meas. Tech.
ChEMBL_2105912 (CHEMBL4814587)
Kd
1.1±n/a nM
Citation
 Klövekorn, PPfaffenrot, BJuchum, MSelig, RAlbrecht, WZender, LLaufer, SA From off-to on-target: New BRAF-inhibitor-template-derived compounds selectively targeting mitogen activated protein kinase kinase 4 (MKK4). Eur J Med Chem 210:0 (2021)  
Target
Name:
Dual specificity mitogen-activated protein kinase kinase 4
Synonyms:
C-JUN N-terminal kinase kinase 1 JNK-activating kinase 1 Jnkk1 MAPK/ERK kinase 4 MP2K4_MOUSE Mek4 Prkmk4 Sek1 Skk1
Type:
PROTEIN
Mol. Mass.:
44120.14
Organism:
Mus musculus
Description:
EBI_11048
Residue:
397
  
Inhibitor
Name:
BDBM50568580
Synonyms:
CHEMBL4857316
Type:
Small organic molecule
Emp. Form.:
C28H22FN5O3S
Mol. Mass.:
527.569
SMILES:
Fc1c(NS(=O)(=O)Cc2ccccc2)cccc1C(=O)c1c[nH]c2ncc(cc12)-c1cnc(nc1)C1CC1
: