Target
cGMP-dependent 3',5'-cyclic phosphodiesterase
Ligand
BDBM50277665
Substrate
Meas. Tech.
ChEMBL_2106366 (CHEMBL4815041)
IC50
3630000±n/a nM
Citation
 Chu, ZXu, QZhu, QMa, XMo, JLin, GZhao, YGu, YBian, LShao, LGuo, JYe, WLi, JHe, GXu, Y Design, synthesis and biological evaluation of novel benzoxaborole derivatives as potent PDE4 inhibitors for topical treatment of atopic dermatitis. Eur J Med Chem 213:0 (2021)  
Target
Name:
cGMP-dependent 3',5'-cyclic phosphodiesterase
Synonyms:
CGS-PDE Homo sapiens phosphodiesterase 2A (PDE2A) PDE2A cGSPDE
Type:
Enzyme Catalytic Domain
Mol. Mass.:
105691.58
Organism:
Homo sapiens (Human)
Description:
O00408
Residue:
941
  
Inhibitor
Name:
BDBM50277665
Synonyms:
4-(1-hydroxy-1,3-dihydrobenzo[c][1,2]oxaborol-5-yloxy)benzonitrile AN-2728 Crisaborole | Eucrisa
Type:
Small organic molecule
Emp. Form.:
C14H10BNO3
Mol. Mass.:
251.045
SMILES:
OB1OCc2cc(Oc3ccc(cc3)C#N)ccc12
: