Target
High affinity cAMP-specific 3',5'-cyclic phosphodiesterase 7A
Ligand
BDBM50277665
Substrate
Meas. Tech.
ChEMBL_2106371 (CHEMBL4815046)
IC50
2030000±n/a nM
Citation
 Chu, ZXu, QZhu, QMa, XMo, JLin, GZhao, YGu, YBian, LShao, LGuo, JYe, WLi, JHe, GXu, Y Design, synthesis and biological evaluation of novel benzoxaborole derivatives as potent PDE4 inhibitors for topical treatment of atopic dermatitis. Eur J Med Chem 213:0 (2021)  
Target
Name:
High affinity cAMP-specific 3',5'-cyclic phosphodiesterase 7A
Synonyms:
3',5'-cyclic phosphodiesterase PDE7A_HUMAN Phosphodiesterase 7 (PDE7) Phosphodiesterase 7A (PDE7A1)
Type:
Enzyme
Mol. Mass.:
55514.96
Organism:
Homo sapiens (Human)
Description:
Q13946
Residue:
482
  
Inhibitor
Name:
BDBM50277665
Synonyms:
4-(1-hydroxy-1,3-dihydrobenzo[c][1,2]oxaborol-5-yloxy)benzonitrile AN-2728 Crisaborole | Eucrisa
Type:
Small organic molecule
Emp. Form.:
C14H10BNO3
Mol. Mass.:
251.045
SMILES:
OB1OCc2cc(Oc3ccc(cc3)C#N)ccc12
: