Target
Cruzipain
Ligand
BDBM50133629
Substrate
Meas. Tech.
ChEBML_210992
IC50
30000±n/a nM
Citation
 Chiyanzu, IHansell, EGut, JRosenthal, PJMcKerrow, JHChibale, K Synthesis and evaluation of isatins and thiosemicarbazone derivatives against cruzain, falcipain-2 and rhodesain. Bioorg Med Chem Lett 13:3527-30 (2003)  
Target
Name:
Cruzipain
Synonyms:
CYSP_TRYCR Cruzaine | Major cysteine proteinase
Type:
Protein
Mol. Mass.:
49831.41
Organism:
Trypanosoma cruzi
Description:
P25779
Residue:
467
  
Inhibitor
Name:
BDBM50133629
Synonyms:
2,3-Dioxo-2,3-dihydro-indole-1-carboxylic acid benzyl ester | CHEMBL119515
Type:
Small organic molecule
Emp. Form.:
C16H11NO4
Mol. Mass.:
281.2628
SMILES:
O=C(OCc1ccccc1)N1C(=O)C(=O)c2ccccc12
: