Target
5-hydroxytryptamine receptor 2C
Ligand
BDBM50568906
Substrate
Meas. Tech.
ChEMBL_2106949 (CHEMBL4815624)
Ki
245±n/a nM
Citation
 Ofori, EOnyameh, EKGonela, UMVoshavar, CBricker, BSwanson, TLEshleman, AJSchmachtenberg, JLBloom, SHJanowsky, AJAblordeppey, SY New dual 5-HT1A and 5-HT7 receptor ligands derived from SYA16263. Eur J Med Chem 214:0 (2021)  
Target
Name:
5-hydroxytryptamine receptor 2C
Synonyms:
5-HT-1C 5-HT1C 5-HTR2C 5HT2C_HUMAN HTR2C | Serotonin receptor 2C
Type:
PROTEIN
Mol. Mass.:
51820.72
Organism:
Homo sapiens
Description:
ChEMBL_104992
Residue:
458
  
Inhibitor
Name:
BDBM50568906
Synonyms:
CHEMBL4875079
Type:
Small organic molecule
Emp. Form.:
C23H28N4O6
Mol. Mass.:
456.4916
SMILES:
OC(=O)C(O)=O.CC(=O)Nc1ccc(cc1)C(=O)CCCN1CCN(CC1)c1ccccn1
: