Target
5-hydroxytryptamine receptor 2C
Ligand
BDBM50568922
Substrate
Meas. Tech.
ChEMBL_2106949 (CHEMBL4815624)
Ki
1000±n/a nM
Citation
 Ofori, EOnyameh, EKGonela, UMVoshavar, CBricker, BSwanson, TLEshleman, AJSchmachtenberg, JLBloom, SHJanowsky, AJAblordeppey, SY New dual 5-HT1A and 5-HT7 receptor ligands derived from SYA16263. Eur J Med Chem 214:0 (2021)  
Target
Name:
5-hydroxytryptamine receptor 2C
Synonyms:
5-HT-1C 5-HT1C 5-HTR2C 5HT2C_HUMAN HTR2C | Serotonin receptor 2C
Type:
PROTEIN
Mol. Mass.:
51820.72
Organism:
Homo sapiens
Description:
ChEMBL_104992
Residue:
458
  
Inhibitor
Name:
BDBM50568922
Synonyms:
CHEMBL4870361
Type:
Small organic molecule
Emp. Form.:
C21H25N3O2
Mol. Mass.:
351.4421
SMILES:
O=C1CCc2cc(OCCCN3CCN(CC3)c3ccccn3)ccc12
: