Target
Prostaglandin E synthase
Ligand
BDBM50426967
Substrate
Meas. Tech.
ChEMBL_2109351 (CHEMBL4818026)
IC50
3.0±n/a nM
Citation
 Kim, MKim, GKang, MKo, DNam, YMoon, CSKang, HMShin, JSWerz, OLee, KTLee, JY Discovery of N-amido-phenylsulfonamide derivatives as novel microsomal prostaglandin E Bioorg Med Chem Lett 41:0 (2021)  
Target
Name:
Prostaglandin E synthase
Synonyms:
MGST1L1 PGES PTGES Prostaglandin E synthase (PGES-1) Prostaglandin E synthase-1 (PGES-1) Prostaglandin E2 synthase-1 ( mPGES-1)
Type:
Protein
Mol. Mass.:
17112.22
Organism:
Homo sapiens (Human)
Description:
Residue:
152
  
Inhibitor
Name:
BDBM50426967
Synonyms:
CHEMBL2325079 | PF-4693627
Type:
Small organic molecule
Emp. Form.:
C26H29Cl2N3O3
Mol. Mass.:
502.433
SMILES:
OC[C@H]1CCC[C@@H](C1)NC(=O)C1CCN(CC1)c1nc2cc(Cl)c(cc2o1)-c1ccc(Cl)cc1
: