Target
Prostaglandin E synthase
Ligand
BDBM50006805
Substrate
Meas. Tech.
ChEMBL_2109351 (CHEMBL4818026)
IC50
2100±n/a nM
Citation
 Kim, MKim, GKang, MKo, DNam, YMoon, CSKang, HMShin, JSWerz, OLee, KTLee, JY Discovery of N-amido-phenylsulfonamide derivatives as novel microsomal prostaglandin E Bioorg Med Chem Lett 41:0 (2021)  
Target
Name:
Prostaglandin E synthase
Synonyms:
MGST1L1 PGES PTGES Prostaglandin E synthase (PGES-1) Prostaglandin E synthase-1 (PGES-1) Prostaglandin E2 synthase-1 ( mPGES-1)
Type:
Protein
Mol. Mass.:
17112.22
Organism:
Homo sapiens (Human)
Description:
Residue:
152
  
Inhibitor
Name:
BDBM50006805
Synonyms:
3-(1-(4-chlorobenzyl)-3-(tert-butylthio)-5-isopropyl-1H-indol-2-yl)-2,2-dimethylpropanoic acid 3-[1-(4-chlorobenzyl)-3-t-butyl-thio-5-isopropylindol-2-yl]-2,2-dimethylpropanoic acid CHEMBL29097 MK886 | cid_3651377
Type:
Small organic molecule
Emp. Form.:
C27H34ClNO2S
Mol. Mass.:
472.082
SMILES:
CC(C)c1ccc2n(Cc3ccc(Cl)cc3)c(CC(C)(C)C(O)=O)c(SC(C)(C)C)c2c1
: