Target
Prostaglandin E synthase
Ligand
BDBM50569444
Substrate
Meas. Tech.
ChEMBL_2109352 (CHEMBL4818027)
IC50
340±n/a nM
Citation
 Kim, MKim, GKang, MKo, DNam, YMoon, CSKang, HMShin, JSWerz, OLee, KTLee, JY Discovery of N-amido-phenylsulfonamide derivatives as novel microsomal prostaglandin E Bioorg Med Chem Lett 41:0 (2021)  
Target
Name:
Prostaglandin E synthase
Synonyms:
5.3.99.3 PTGES_MOUSE Prostaglandin E synthase mPGES-1
Type:
PROTEIN
Mol. Mass.:
17293.88
Organism:
Mus musculus
Description:
ChEMBL_104562
Residue:
153
  
Inhibitor
Name:
BDBM50569444
Synonyms:
CHEMBL4848472
Type:
Small organic molecule
Emp. Form.:
C27H22ClNO5S
Mol. Mass.:
507.985
SMILES:
Clc1ccc(cc1)S(=O)(=O)N(Cc1ccccc1)C(=O)Oc1ccc(OCc2ccccc2)cc1
: