Target
Prostaglandin E synthase
Ligand
BDBM50569444
Substrate
Meas. Tech.
ChEMBL_2109354 (CHEMBL4818029)
IC50
2000±n/a nM
Citation
 Kim, MKim, GKang, MKo, DNam, YMoon, CSKang, HMShin, JSWerz, OLee, KTLee, JY Discovery of N-amido-phenylsulfonamide derivatives as novel microsomal prostaglandin E Bioorg Med Chem Lett 41:0 (2021)  
Target
Name:
Prostaglandin E synthase
Synonyms:
MGST1L1 PGES PTGES Prostaglandin E synthase (PGES-1) Prostaglandin E synthase-1 (PGES-1) Prostaglandin E2 synthase-1 ( mPGES-1)
Type:
Protein
Mol. Mass.:
17112.22
Organism:
Homo sapiens (Human)
Description:
Residue:
152
  
Inhibitor
Name:
BDBM50569444
Synonyms:
CHEMBL4848472
Type:
Small organic molecule
Emp. Form.:
C27H22ClNO5S
Mol. Mass.:
507.985
SMILES:
Clc1ccc(cc1)S(=O)(=O)N(Cc1ccccc1)C(=O)Oc1ccc(OCc2ccccc2)cc1
: