Target
Prostaglandin E2 receptor EP1 subtype
Ligand
BDBM50134529
Substrate
Meas. Tech.
ChEBML_158175
Ki
27000±n/a nM
Citation
 Gallant, MBelley, MCarrière, MCChateauneuf, ADenis, DLachance, NLamontagne, SMetters, KMSawyer, NSlipetz, DTruchon, JFLabelle, M Structure-activity relationship of triaryl propionic acid analogues on the human EP3 prostanoid receptor. Bioorg Med Chem Lett 13:3813-6 (2003)  
Target
Name:
Prostaglandin E2 receptor EP1 subtype
Synonyms:
PE2R1_HUMAN PTGER1 Prostaglandin E2 receptor EP1 subtype Prostanoid EP1 receptor
Type:
Enzyme
Mol. Mass.:
41834.57
Organism:
Homo sapiens (Human)
Description:
P34995
Residue:
402
  
Inhibitor
Name:
BDBM50134529
Synonyms:
3-{2-[5-(2-Benzyloxy-phenyl)-thiophen-2-yl]-phenyl}-propionic acid | CHEMBL125110
Type:
Small organic molecule
Emp. Form.:
C26H22O3S
Mol. Mass.:
414.516
SMILES:
OC(=O)CCc1ccccc1-c1ccc(s1)-c1ccccc1OCc1ccccc1
: