Target
Nicotinamide phosphoribosyltransferase
Ligand
BDBM50569509
Substrate
Meas. Tech.
ChEMBL_2109463 (CHEMBL4818138)
EC50
10800±n/a nM
Citation
 Pinkerton, ABSessions, EHHershberger, PMaloney, PRPeddibhotla, SHopf, MSergienko, EMa, CTSmith, LHJackson, MRTanaka, JTsuji, TAkiu, MCohen, SENakamura, TGardell, SJ Optimization of a urea-containing series of nicotinamide phosphoribosyltransferase (NAMPT) activators. Bioorg Med Chem Lett 41:0 (2021)  
Target
Name:
Nicotinamide phosphoribosyltransferase
Synonyms:
NAMPT NAmPRTase Nicotinamide phosphoribosyltransferase (NAMPT) PBEF1 | Pre-B-cell colony-enhancing factor 1
Type:
Enzyme
Mol. Mass.:
55524.98
Organism:
Homo sapiens (Human)
Description:
P43490
Residue:
491
  
Inhibitor
Name:
BDBM50569509
Synonyms:
CHEMBL4849439
Type:
Small organic molecule
Emp. Form.:
C16H16N2O4
Mol. Mass.:
300.3092
SMILES:
CCOC(=O)c1ccc(NC(=O)OCc2ccncc2)cc1
: